Target
Kinesin-like protein KIF11
Ligand
BDBM50293771
Substrate
Meas. Tech.
ChEMBL_571916 (CHEMBL1035565)
IC50
>20000±n/a nM
Citation
 Lahue, BRMa, YShipps, GWSeghezzi, WHerbst, R Substituted benzimidazoles: A novel chemotype for small molecule hKSP inhibitors. Bioorg Med Chem Lett 19:3405-9 (2009)  
Target
Name:
Kinesin-like protein KIF11
Synonyms:
EG5 KIF11_HUMAN Kinesin Spindle Protein Eg5 TRIP5 | kinesin spindle protein
Type:
PROTEIN
Mol. Mass.:
119138.97
Organism:
Homo sapiens (Human)
Description:
ChEMBL_1457426
Residue:
1056
  
Inhibitor
Name:
BDBM50293771
Synonyms:
2-(3-aminopyrrolidin-1-yl)-1-(2-(trifluoromethyl)benzyl)-1H-benzo[d]imidazole-5-carboxylic acid | CHEMBL564345
Type:
Small organic molecule
Emp. Form.:
C20H19F3N4O2
Mol. Mass.:
404.3857
SMILES:
NC1CCN(C1)c1nc2cc(ccc2n1Cc1ccccc1C(F)(F)F)C(O)=O
: