Target
Cytochrome P450 2C9
Ligand
BDBM50293753
Substrate
Meas. Tech.
ChEMBL_571927 (CHEMBL1035576)
IC50
>8000±n/a nM
Citation
 Lahue, BRMa, YShipps, GWSeghezzi, WHerbst, R Substituted benzimidazoles: A novel chemotype for small molecule hKSP inhibitors. Bioorg Med Chem Lett 19:3405-9 (2009)  
Target
Name:
Cytochrome P450 2C9
Synonyms:
(R)-limonene 6-monooxygenase CP2C9_HUMAN CYP2C9 Cytochrome P450 2C9 (CYP2C9 ) P-450MP P450 PB-1 | S-mephenytoin 4-hydroxylase
Type:
Enzyme
Mol. Mass.:
55636.33
Organism:
Homo sapiens (Human)
Description:
P11712
Residue:
490
  
Inhibitor
Name:
BDBM50293753
Synonyms:
2-(4-(methylsulfonyl)phenylamino)-1-(2-(trifluoromethyl)benzyl)-1H-benzo[d]imidazole-5-carboxamide KSP Inhibitor, 4b
Type:
Small organic molecule
Emp. Form.:
C23H19F3N4O3S
Mol. Mass.:
488.482
SMILES:
CS(=O)(=O)c1ccc(Nc2nc3cc(ccc3n2Cc2ccccc2C(F)(F)F)C(N)=O)cc1
: