Target
Neuraminidase
Ligand
BDBM50295345
Substrate
Meas. Tech.
ChEMBL_578382 (CHEMBL1057938)
IC50
5000000±n/a nM
Citation
 Sakamoto, JKoyama, TMiyamoto, DYingsakmongkon, SHidari, KIJampangern, WSuzuki, TSuzuki, YEsumi, YNakamura, THatano, KTerunuma, DMatsuoka, K Systematic syntheses of influenza neuraminidase inhibitors: a series of carbosilane dendrimers uniformly functionalized with thioglycoside-type sialic acid moieties. Bioorg Med Chem 17:5451-64 (2009)  
Target
Name:
Neuraminidase
Synonyms:
NA | NRAM_I71A1
Type:
PROTEIN
Mol. Mass.:
52105.18
Organism:
Influenza A virus (strain A/Memphis/1/1971 H3N2)
Description:
ChEMBL_578382
Residue:
469
  
Inhibitor
Name:
BDBM50295345
Synonyms:
(R,R,2S,2'S,4S,4'S,5R,5'R,6R,6'R)-2,2'-(14,14-bis(3-(3-(5-((2S,4S,5R,6R)-5-acetamido-2-carboxy-4-hydroxy-6-((1R,2R)-1,2,3-trihydroxypropyl)tetrahydro-2H-pyran-2-ylthio)pentylthio)propoxy)propyl)-10,18-dioxa-6,22-dithia-14-silaheptacosane-1,27-diyl)bis(sulfanediyl)bis(5-acetamido-4-hydroxy-6-((1R,2R)-1,2,3-trihydroxypropyl)tetrahydro-2H-pyran-2-carboxylic acid) | CHEMBL538892
Type:
Small organic molecule
Emp. Form.:
C88H160N4O36S8Si
Mol. Mass.:
2134.823
SMILES:
CC(=O)N[C@@H]1[C@@H](O)C[C@](O[C@H]1[C@H](O)[C@H](O)CO)(SCCCCCSCCCOCCC[Si](CCCOCCCSCCCCCS[C@@]1(C[C@H](O)[C@@H](NC(C)=O)[C@@H](O1)[C@H](O)[C@H](O)CO)C(O)=O)(CCCOCCCSCCCCCS[C@@]1(C[C@H](O)[C@@H](NC(C)=O)[C@@H](O1)[C@H](O)[C@H](O)CO)C(O)=O)CCCOCCCSCCCCCS[C@@]1(C[C@H](O)[C@@H](NC(C)=O)[C@@H](O1)[C@H](O)[C@H](O)CO)C(O)=O)C(O)=O
: