Target
Replicative DNA helicase
Ligand
BDBM34851
Substrate
Meas. Tech.
ChEMBL_578771 (CHEMBL1052344)
IC50
42000±n/a nM
Citation
 Aiello, DBarnes, MHBiswas, EEBiswas, SBGu, SWilliams, JDBowlin, TLMoir, DT Discovery, characterization and comparison of inhibitors of Bacillus anthracis and Staphylococcus aureus replicative DNA helicases. Bioorg Med Chem 17:4466-76 (2009)  
Target
Name:
Replicative DNA helicase
Synonyms:
DnaC helicase
Type:
PROTEIN
Mol. Mass.:
52545.35
Organism:
Staphylococcus aureus
Description:
ChEMBL_578771
Residue:
466
  
Inhibitor
Name:
BDBM34851
Synonyms:
3-benzyl-7,8-dihydroxy-4-methyl-2H-chromen-2-one 3-benzyl-7,8-dihydroxy-4-methylchromen-2-one 7,8-dihydroxy-4-methyl-3-(phenylmethyl)-1-benzopyran-2-one SMR000300452 | cid_5428528
Type:
Small organic molecule
Emp. Form.:
C17H14O4
Mol. Mass.:
282.2907
SMILES:
Cc1c(Cc2ccccc2)c(=O)oc2c(O)c(O)ccc12
: