Target
cGMP-specific 3',5'-cyclic phosphodiesterase
Ligand
BDBM50297811
Substrate
Meas. Tech.
ChEMBL_584078 (CHEMBL1058319)
IC50
15±n/a nM
Citation
 Owen, DRWalker, JKJon Jacobsen, EFreskos, JNHughes, ROBrown, DLBell, ASBrown, DGPhillips, CMischke, BVMolyneaux, JMFobian, YMHeasley, SEMoon, JBStallings, WCJoseph Rogier, DFox, DNPalmer, MJRinger, TRodriquez-Lens, MCubbage, JWBlevis-Bal, RMBenson, AGAcker, BAMaddux, TMTollefson, MBBond, BRMacinnes, AYu, Y Identification, synthesis and SAR of amino substituted pyrido[3,2b]pyrazinones as potent and selective PDE5 inhibitors. Bioorg Med Chem Lett 19:4088-91 (2009)  
Target
Name:
cGMP-specific 3',5'-cyclic phosphodiesterase
Synonyms:
3',5'-cyclic phosphodiesterase PDE5 PDE5A_HUMAN Phosphodiesterase 5 (PDE5) Phosphodiesterase 5A (PDE5A) cGMP-specific 3',5'-cyclic phosphodiesterase
Type:
Protein
Mol. Mass.:
99975.83
Organism:
Homo sapiens (Human)
Description:
O76074
Residue:
875
  
Inhibitor
Name:
BDBM50297811
Synonyms:
2-(6-(6-methoxypyridin-3-yl)-3-oxo-4-(2-propoxyethyl)-3,4-dihydropyrido[2,3-b]pyrazin-2-ylamino)-N,N-dimethylacetamide | CHEMBL563669
Type:
Small organic molecule
Emp. Form.:
C22H28N6O4
Mol. Mass.:
440.4955
SMILES:
CCCOCCn1c2nc(ccc2nc(NCC(=O)N(C)C)c1=O)-c1ccc(OC)nc1
: