Target
Mitogen-activated protein kinase 14
Ligand
BDBM50300885
Substrate
Meas. Tech.
ChEMBL_599883 (CHEMBL1045448)
IC50
30±n/a nM
Citation
 Peifer, CAbadleh, MBischof, JHauser, DSchattel, VHirner, HKnippschild, ULaufer, S 3,4-Diaryl-isoxazoles and -imidazoles as potent dual inhibitors of p38alpha mitogen activated protein kinase and casein kinase 1delta. J Med Chem 52:7618-30 (2009)  
Target
Name:
Mitogen-activated protein kinase 14
Synonyms:
CSAID-binding protein CSBP1 CSPB1 MAP kinase 14 MAP kinase p38 alpha MAPK14 MK14_HUMAN Mitogen-activated protein kinase p38 alpha Stress-activated protein kinase 2a | p38 MAP kinase alpha/beta
Type:
Serine/threonine-protein kinase
Mol. Mass.:
41286.76
Organism:
Homo sapiens (Human)
Description:
Q16539
Residue:
360
  
Inhibitor
Name:
BDBM50300885
Synonyms:
CHEMBL569551 | N-sec-butyl-4-(3-(4-fluorophenyl)-5-isopropylisoxazol-4-yl)pyridin-2-amine
Type:
Small organic molecule
Emp. Form.:
C21H24FN3O
Mol. Mass.:
353.4332
SMILES:
CCC(C)Nc1cc(ccn1)-c1c(noc1C(C)C)-c1ccc(F)cc1
: