Target
Neutrophil elastase
Ligand
BDBM50235612
Substrate
Meas. Tech.
ChEMBL_595760 (CHEMBL1045283)
Kd
57.9±n/a nM
Citation
 Mulchande, JOliveira, RCarrasco, MGouveia, LGuedes, RCIley, JMoreira, R 4-Oxo-beta-lactams (azetidine-2,4-diones) are potent and selective inhibitors of human leukocyte elastase. J Med Chem 53:241-53 (2010)  
Target
Name:
Neutrophil elastase
Synonyms:
Bone marrow serine protease Coagulation factor X ELANE Elastase HLE Leukocyte elastase Medullasin Neutrophil elastase (HNE) PMN elastase Trypsin
Type:
Enzyme
Mol. Mass.:
28532.38
Organism:
Homo sapiens (Human)
Description:
P08246
Residue:
267
  
Inhibitor
Name:
BDBM50235612
Synonyms:
1-(4-chlorophenyl)-3,3-diethylazetidine-2,4-dione | CHEMBL406492
Type:
Small organic molecule
Emp. Form.:
C13H14ClNO2
Mol. Mass.:
251.709
SMILES:
CCC1(CC)C(=O)N(C1=O)c1ccc(Cl)cc1
: