Target
Neuropeptide Y receptor type 5
Ligand
BDBM50304297
Substrate
Meas. Tech.
ChEMBL_606463 (CHEMBL1074028)
IC50
1.7±n/a nM
Citation
 Haga, YSakamoto, TShibata, TNonoshita, KIshikawa, MSuga, TTakahashi, HTakahashi, TTakahashi, HAndo, MMurai, TGomori, AOda, ZKitazawa, HMitobe, YKanesaka, MOhe, TIwaasa, HIshii, YIshihara, AKanatani, AFukami, T Discovery of trans-N-[1-(2-fluorophenyl)-3-pyrazolyl]-3-oxospiro[6-azaisobenzofuran-1(3H),1'-cyclohexane]-4'-carboxamide, a potent and orally active neuropeptide Y Y5 receptor antagonist. Bioorg Med Chem 17:6971-82 (2009)  
Target
Name:
Neuropeptide Y receptor type 5
Synonyms:
NPY-Y5 Neuropeptide Y receptor type 5 Npyr5
Type:
Enzyme Catalytic Domain
Mol. Mass.:
50435.58
Organism:
Rat 6B
Description:
NPY-Y5 NPY5R Rat 6B::Q63634
Residue:
445
  
Inhibitor
Name:
BDBM50304297
Synonyms:
CHEMBL594163 | trans-3-Oxo-N-(1-phenyl-1H-pyrazol-3-yl)-3H-spiro[4-aza-2-benzofuran-1,1'-cyclohexane]-4'-carboxamide
Type:
Small organic molecule
Emp. Form.:
C22H20N4O3
Mol. Mass.:
388.4192
SMILES:
O=C(Nc1ccn(n1)-c1ccccc1)[C@H]1CC[C@@]2(CC1)OC(=O)c1ncccc21
: