Target
Oxysterols receptor LXR-alpha
Ligand
BDBM50305062
Substrate
Meas. Tech.
ChEMBL_603036 (CHEMBL1047697)
IC50
3.2±n/a nM
Citation
 Bernotas, RCSinghaus, RRKaufman, DHTravins, JMUllrich, JWUnwalla, RQuinet, EEvans, MNambi, POlland, AKauppi, BWilhelmsson, AGoos-Nilsson, AWrobel, J 4-(3-Aryloxyaryl)quinoline sulfones are potent liver X receptor agonists. Bioorg Med Chem Lett 20:209-12 (2010)  
Target
Name:
Oxysterols receptor LXR-alpha
Synonyms:
LXRA Liver X receptor alpha Liver X receptor alpha (NR1H3) NR1H3 Nuclear orphan receptor LXR-alpha | Nuclear receptor subfamily 1 group H member 3
Type:
Enzyme Catalytic Domain
Mol. Mass.:
50403.85
Organism:
Homo sapiens (Human)
Description:
Q13133
Residue:
447
  
Inhibitor
Name:
BDBM50305062
Synonyms:
4-(3-(3-(3-methoxypropylsulfonyl)phenoxy)phenyl)-3-methyl-8-(trifluoromethyl)quinoline | CHEMBL595804
Type:
Small organic molecule
Emp. Form.:
C27H24F3NO4S
Mol. Mass.:
515.544
SMILES:
COCCCS(=O)(=O)c1cccc(Oc2cccc(c2)-c2c(C)cnc3c(cccc23)C(F)(F)F)c1
: