Target
Serine/threonine-protein kinase mTOR
Ligand
BDBM50305297
Substrate
Meas. Tech.
ChEMBL_603510 (CHEMBL1068429)
IC50
590±n/a nM
Citation
 Venkatesan, AMDehnhardt, CMChen, ZSantos, EDDos Santos, OBursavich, MGilbert, AMEllingboe, JWAyral-Kaloustian, SKhafizova, GBrooijmans, NMallon, RHollander, IFeldberg, LLucas, JYu, KGibbons, JAbraham, RMansour, TS Novel imidazolopyrimidines as dual PI3-Kinase/mTOR inhibitors. Bioorg Med Chem Lett 20:653-6 (2010)  
Target
Name:
Serine/threonine-protein kinase mTOR
Synonyms:
FK506-binding protein 12-rapamycin complex-associated protein 1 FRAP FRAP1 MTOR Mammalian Target of Rapamycin (mTOR) RAFT1 Rapamycin and FKBP12 target 1 Serine/threonine-protein kinase (mTOR) | mTORC2
Type:
Rapamycin target protein
Mol. Mass.:
288917.12
Organism:
Homo sapiens (Human)
Description:
P42345
Residue:
2549
  
Inhibitor
Name:
BDBM50305297
Synonyms:
5-(9-(1-(4-methylbenzyl)piperidin-4-yl)-6-morpholino-9H-purin-2-yl)pyridin-3-ol | CHEMBL604247
Type:
Small organic molecule
Emp. Form.:
C27H31N7O2
Mol. Mass.:
485.5807
SMILES:
Cc1ccc(CN2CCC(CC2)n2cnc3c(nc(nc23)-c2cncc(O)c2)N2CCOCC2)cc1
: