Target
Serine/threonine-protein kinase mTOR
Ligand
BDBM50305304
Substrate
Meas. Tech.
ChEMBL_603510 (CHEMBL1068429)
IC50
200±n/a nM
Citation
 Venkatesan, AMDehnhardt, CMChen, ZSantos, EDDos Santos, OBursavich, MGilbert, AMEllingboe, JWAyral-Kaloustian, SKhafizova, GBrooijmans, NMallon, RHollander, IFeldberg, LLucas, JYu, KGibbons, JAbraham, RMansour, TS Novel imidazolopyrimidines as dual PI3-Kinase/mTOR inhibitors. Bioorg Med Chem Lett 20:653-6 (2010)  
Target
Name:
Serine/threonine-protein kinase mTOR
Synonyms:
FK506-binding protein 12-rapamycin complex-associated protein 1 FRAP FRAP1 MTOR Mammalian Target of Rapamycin (mTOR) RAFT1 Rapamycin and FKBP12 target 1 Serine/threonine-protein kinase (mTOR) | mTORC2
Type:
Rapamycin target protein
Mol. Mass.:
288917.12
Organism:
Homo sapiens (Human)
Description:
P42345
Residue:
2549
  
Inhibitor
Name:
BDBM50305304
Synonyms:
3-(9-(1-((5-chloropyridin-3-yl)methyl)piperidin-4-yl)-6-morpholino-9H-purin-2-yl)phenol | CHEMBL593064
Type:
Small organic molecule
Emp. Form.:
C26H28ClN7O2
Mol. Mass.:
505.999
SMILES:
Oc1cccc(c1)-c1nc(N2CCOCC2)c2ncn(C3CCN(Cc4cncc(Cl)c4)CC3)c2n1
: