Target
Fructose-1,6-bisphosphatase 1
Ligand
BDBM50305568
Substrate
Meas. Tech.
ChEMBL_604516 (CHEMBL1074686)
EC50
12000±n/a nM
Citation
 Kitas, EMohr, PKuhn, BHebeisen, PWessel, HPHaap, WRuf, ABenz, JJoseph, CHuber, WSanchez, RAPaehler, ABenardeau, AGubler, MSchott, BTozzo, E Sulfonylureido thiazoles as fructose-1,6-bisphosphatase inhibitors for the treatment of type-2 diabetes. Bioorg Med Chem Lett 20:594-9 (2010)  
Target
Name:
Fructose-1,6-bisphosphatase 1
Synonyms:
F16P1_MOUSE Fbp1 | Fbp3
Type:
PROTEIN
Mol. Mass.:
36912.07
Organism:
Mus musculus
Description:
ChEMBL_748173
Residue:
338
  
Inhibitor
Name:
BDBM50305568
Synonyms:
CHEMBL585620 | N-(5-bromothiazol-2-ylcarbamoyl)-5-(2-methoxyethoxy)-4-methylthiophene-2-sulfonamide
Type:
Small organic molecule
Emp. Form.:
C12H14BrN3O5S3
Mol. Mass.:
456.356
SMILES:
COCCOc1sc(cc1C)S(=O)(=O)NC(=O)Nc1ncc(Br)s1
: