Target
Cannabinoid receptor 2
Ligand
BDBM50305989
Substrate
Meas. Tech.
ChEMBL_605682 (CHEMBL1071212)
Ki
0.39±n/a nM
Citation
 Gilbert, EJZhou, GWong, MKTong, LShankar, BBHuang, CKelly, JLavey, BJMcCombie, SWChen, LRizvi, RDong, YShu, YKozlowski, JAShih, NYHipkin, RWGonsiorek, WMalikzay, ALunn, CAFavreau, LLundell, DJ Non-aromatic A-ring replacement in the triaryl bis-sulfone CB2 receptor inhibitors. Bioorg Med Chem Lett 20:608-11 (2010)  
Target
Name:
Cannabinoid receptor 2
Synonyms:
CANNABINOID CB2 CB2 CB2B CNR2_HUMAN Cannabinoid CB2 receptor Cannabinoid receptor 2 (CB2R) | hCB2
Type:
G Protein-Coupled Receptor (GPCR)
Mol. Mass.:
39690.94
Organism:
Homo sapiens (Human)
Description:
P34972
Residue:
360
  
Inhibitor
Name:
BDBM50305989
Synonyms:
CHEMBL596387 | N-((1-(4-chloro-2-(2-fluorophenylsulfonyl)phenylsulfonyl)-4-methylpiperidin-4-yl)methyl)-1,1,1-trifluoromethanesulfonamide
Type:
Small organic molecule
Emp. Form.:
C20H21ClF4N2O6S3
Mol. Mass.:
593.032
SMILES:
CC1(CNS(=O)(=O)C(F)(F)F)CCN(CC1)S(=O)(=O)c1ccc(Cl)cc1S(=O)(=O)c1ccccc1F
: