Target
Stearoyl-CoA desaturase
Ligand
BDBM50306131
Substrate
Meas. Tech.
ChEMBL_606058 (CHEMBL1071957)
IC50
0.06±n/a nM
Citation
 Uto, YKiyotsuka, YUeno, YMiyazawa, YKurata, HOgata, TDeguchi, TYamada, MWatanabe, NKonishi, MKurikawa, NTakagi, TWakimoto, SKono, KOhsumi, J Novel spiropiperidine-based stearoyl-CoA desaturase-1 inhibitors: Identification of 1'-{6-[5-(pyridin-3-ylmethyl)-1,3,4-oxadiazol-2-yl]pyridazin-3-yl}-5-(trifluoromethyl)-3,4-dihydrospiro[chromene-2,4'-piperidine]. Bioorg Med Chem Lett 20:746-54 (2010)  
Target
Name:
Stearoyl-CoA desaturase
Synonyms:
Acyl-CoA desaturase SCD SCDOS Stearoyl-CoA (SCD1) | Stearoyl-CoA desaturase 1
Type:
Enzyme
Mol. Mass.:
41537.27
Organism:
Homo sapiens (Human)
Description:
O00767
Residue:
359
  
Inhibitor
Name:
BDBM50306131
Synonyms:
1'-(6-(5-(pyridin-3-ylmethyl)-1,3,4-oxadiazol-2-yl)pyridazin-3-yl)-5-(trifluoromethyl)spiro[chroman-2,4'-piperidine] | CHEMBL593108
Type:
Small organic molecule
Emp. Form.:
C26H23F3N6O2
Mol. Mass.:
508.495
SMILES:
FC(F)(F)c1cccc2OC3(CCN(CC3)c3ccc(nn3)-c3nnc(Cc4cccnc4)o3)CCc12
: