Target
Hepatocyte growth factor receptor
Ligand
BDBM50306684
Substrate
Meas. Tech.
ChEMBL_611549 (CHEMBL1066393)
IC50
9.3±n/a nM
Citation
 Nishii, HChiba, TMorikami, KFukami, TASakamoto, HKo, KKoyano, H Discovery of 6-benzyloxyquinolines as c-Met selective kinase inhibitors. Bioorg Med Chem Lett 20:1405-9 (2010)  
Target
Name:
Hepatocyte growth factor receptor
Synonyms:
Hepatocyte growth factor receptor Hepatocyte growth factor receptor (c-MET) MET Met proto-oncogene (hepatocyte growth factor receptor) Tyrosine-protein kinase Met (c-Met) c-Met kinase
Type:
Protein
Mol. Mass.:
155559.73
Organism:
Homo sapiens (Human)
Description:
P08581
Residue:
1390
  
Inhibitor
Name:
BDBM50306684
Synonyms:
2-(6-((R)-1-(2,6-dichloro-3-fluorophenyl)ethoxy)quinolin-3-yl)cyclopropanecarboxamide | CHEMBL602472
Type:
Small organic molecule
Emp. Form.:
C21H17Cl2FN2O2
Mol. Mass.:
419.276
SMILES:
C[C@@H](Oc1ccc2ncc(cc2c1)C1CC1C(N)=O)c1c(Cl)ccc(F)c1Cl
: