Target
Adenosine receptor A2a
Ligand
BDBM50306753
Substrate
Meas. Tech.
ChEMBL_611932 (CHEMBL1071493)
Ki
>100000±n/a nM
Citation
 Katritch, VJaakola, VPLane, JRLin, JIjzerman, APYeager, MKufareva, IStevens, RCAbagyan, R Structure-based discovery of novel chemotypes for adenosine A(2A) receptor antagonists. J Med Chem 53:1799-809 (2010)  
Target
Name:
Adenosine receptor A2a
Synonyms:
A2A adenosine receptor (hA2A) ADENOSINE A2 ADORA2 Adenosine A2A receptor (A2AAR)
Type:
G Protein-Coupled Receptor (GPCR)
Mol. Mass.:
44716.46
Organism:
Homo sapiens (Human)
Description:
P29274
Residue:
412
  
Inhibitor
Name:
BDBM50306753
Synonyms:
2-(benzo[d][1,3]dioxol-5-yl)-5-imino-9-methyl-5H-chromeno[3,4-c]pyridin-4-amine | CHEMBL602480
Type:
Small organic molecule
Emp. Form.:
C20H15N3O3
Mol. Mass.:
345.3514
SMILES:
Cc1ccc2oc(=N)c3c(N)nc(cc3c2c1)-c1ccc2OCOc2c1
: