Target
Adenosine receptor A2a
Ligand
BDBM50306758
Substrate
Meas. Tech.
ChEMBL_611932 (CHEMBL1071493)
Ki
>100000±n/a nM
Citation
 Katritch, VJaakola, VPLane, JRLin, JIjzerman, APYeager, MKufareva, IStevens, RCAbagyan, R Structure-based discovery of novel chemotypes for adenosine A(2A) receptor antagonists. J Med Chem 53:1799-809 (2010)  
Target
Name:
Adenosine receptor A2a
Synonyms:
A2A adenosine receptor (hA2A) ADENOSINE A2 ADORA2 Adenosine A2A receptor (A2AAR)
Type:
G Protein-Coupled Receptor (GPCR)
Mol. Mass.:
44716.46
Organism:
Homo sapiens (Human)
Description:
P29274
Residue:
412
  
Inhibitor
Name:
BDBM50306758
Synonyms:
2-amino-6,7-dimethyl-4-oxo-4H-chromene-3-carbaldehyde | CHEMBL601874
Type:
Small organic molecule
Emp. Form.:
C12H11NO3
Mol. Mass.:
217.2206
SMILES:
Cc1cc2oc(N)c(C=O)c(=O)c2cc1C
: