Target
Poly [ADP-ribose] polymerase 1
Ligand
BDBM50309357
Substrate
Meas. Tech.
ChEMBL_609454 (CHEMBL1069748)
IC50
1±n/a nM
Citation
 Pescatore, GBranca, DFiore, FKinzel, OBufi, LLMuraglia, EOrvieto, FRowley, MToniatti, CTorrisi, CJones, P Identification and SAR of novel pyrrolo[1,2-a]pyrazin-1(2H)-one derivatives as inhibitors of poly(ADP-ribose) polymerase-1 (PARP-1). Bioorg Med Chem Lett 20:1094-9 (2010)  
Target
Name:
Poly [ADP-ribose] polymerase 1
Synonyms:
(ARTD1 or PARP1) 2.4.2.30 ADPRT ARTD1 Human diphtheria toxin-like ADP-ribosyltransferase (ARTD1 or PARP1) NT-PARP-1 PARP1 PPOL Poly [ADP-ribose] polymerase 1 (PARP) Poly [ADP-ribose] polymerase 1 (PARP1) Poly [ADP-ribose] polymerase 1, 28-kDa form Poly [ADP-ribose] polymerase 1, processed C-terminus Poly [ADP-ribose] polymerase-1 Poly(ADP-ribose) polymerase-1 (ARTD1/PARP1) Protein poly-ADP-ribosyltransferase PARP1 | Synonyms=ADPRT
Type:
Mol. Mass.:
113114.22
Organism:
Homo sapiens (Human)
Description:
P09874
Residue:
1014
  
Inhibitor
Name:
BDBM50309357
Synonyms:
6,7-dichloro-4-(4-fluoro-3-(4-(quinazolin-2-yl)piperazine-1-carbonyl)benzyl)pyrrolo[1,2-a]pyrazin-1(2H)-one | CHEMBL603135
Type:
Small organic molecule
Emp. Form.:
C27H21Cl2FN6O2
Mol. Mass.:
551.399
SMILES:
Fc1ccc(Cc2c[nH]c(=O)c3cc(Cl)c(Cl)n23)cc1C(=O)N1CCN(CC1)c1ncc2ccccc2n1
: