Target
Phospholipase A-2-activating protein
Ligand
BDBM50309563
Substrate
Meas. Tech.
ChEMBL_610122 (CHEMBL1074487)
IC50
2200±n/a nM
Citation
 Lanier, MSergienko, ESimão, AMSu, YChung, TMillán, JLCashman, JR Design and synthesis of selective inhibitors of placental alkaline phosphatase. Bioorg Med Chem 18:573-9 (2010)  
Target
Name:
Phospholipase A-2-activating protein
Synonyms:
PLAA PLAP_HUMAN
Type:
PROTEIN
Mol. Mass.:
87154.11
Organism:
Homo sapiens (Human)
Description:
ChEMBL_610122
Residue:
795
  
Inhibitor
Name:
BDBM50309563
Synonyms:
2-(2-(3,4-dihydroxyphenyl)-2-oxoethylthio)-4-(methoxymethyl)-6-methylnicotinonitrile cid_586278
Type:
Small organic molecule
Emp. Form.:
C17H16N2O4S
Mol. Mass.:
344.385
SMILES:
COCc1cc(C)nc(SCC(=O)c2ccc(O)c(O)c2)c1C#N
: