Target
Phospholipase A-2-activating protein
Ligand
BDBM46047
Substrate
Meas. Tech.
ChEMBL_610122 (CHEMBL1074487)
IC50
4900±n/a nM
Citation
 Lanier, MSergienko, ESimão, AMSu, YChung, TMillán, JLCashman, JR Design and synthesis of selective inhibitors of placental alkaline phosphatase. Bioorg Med Chem 18:573-9 (2010)  
Target
Name:
Phospholipase A-2-activating protein
Synonyms:
PLAA PLAP_HUMAN
Type:
PROTEIN
Mol. Mass.:
87154.11
Organism:
Homo sapiens (Human)
Description:
ChEMBL_610122
Residue:
795
  
Inhibitor
Name:
BDBM46047
Synonyms:
1-[3,4-bis(oxidanyl)phenyl]-2-(4-bromanyl-2-methyl-imidazol-1-yl)ethanone;hydrochloride 2-(4-bromo-2-methyl-imidazol-1-yl)-1-(3,4-dihydroxyphenyl)ethanone;hydrochloride CHEMBL597109 cid_25067477
Type:
Small organic molecule
Emp. Form.:
C12H11BrN2O3
Mol. Mass.:
311.131
SMILES:
Cc1nc(Br)cn1CC(=O)c1ccc(O)c(O)c1
: