Target
Deoxycytidine kinase
Ligand
BDBM50311559
Substrate
Meas. Tech.
ChEMBL_618320 (CHEMBL1101184)
EC50
27±n/a nM
Citation
 Tarver, JEJessop, TCCarlsen, MAugeri, DJFu, QHealy, JPHeim-Riether, AXu, ATaylor, JAShen, MKeyes, PEDavid Kimball, SYu, XCMiranda, MLiu, QSwaffield, JCNouraldeen, AWilson, AGFinch, RJhaver, KFoushee, AMAnderson, SOravecz, TCarson, KG 5-Fluorocytosine derivatives as inhibitors of deoxycytidine kinase. Bioorg Med Chem Lett 19:6780-3 (2009)  
Target
Name:
Deoxycytidine kinase
Synonyms:
DCK | DCK_HUMAN
Type:
PROTEIN
Mol. Mass.:
30510.65
Organism:
Homo sapiens (Human)
Description:
ChEMBL_1437135
Residue:
260
  
Inhibitor
Name:
BDBM50311559
Synonyms:
2-(1-(6-(4-chloro-2-methylphenoxy)pyrimidin-4-yl)piperidin-4-yloxy)-5-fluoropyrimidin-4-amine | CHEMBL1081544
Type:
Small organic molecule
Emp. Form.:
C20H20ClFN6O2
Mol. Mass.:
430.863
SMILES:
Cc1cc(Cl)ccc1Oc1cc(ncn1)N1CCC(CC1)Oc1ncc(F)c(N)n1
: