Target
RAC-alpha serine/threonine-protein kinase
Ligand
BDBM50312751
Substrate
Meas. Tech.
ChEMBL_615644 (CHEMBL1104218)
IC50
40±n/a nM
Citation
 Zeng, QBourbeau, MPWohlhieter, GEYao, GMonenschein, HRider, JTLee, MRZhang, SLofgren, JFreeman, DLi, CTominey, EHuang, XHoffman, DYamane, HTasker, ASDominguez, CViswanadhan, VNHungate, RZhang, X 2-Aminothiadiazole inhibitors of AKT1 as potential cancer therapeutics. Bioorg Med Chem Lett 20:1652-6 (2010)  
Target
Name:
RAC-alpha serine/threonine-protein kinase
Synonyms:
AKT phosphorylation (p-AKT) AKT1/PPP1CA C-AKT PKB alpha Protein kinase B Protein kinase B (Akt 1) Protein kinase B alpha Proto-oncogene Akt (Akt1) Proto-oncogene c-Akt (AKT1) RAC-PK-alpha RAC-alpha serine/threonine-protein kinase (AKT1) | RAC-alpha serine/threonine-protein kinase (pAKT)
Type:
Enzyme
Mol. Mass.:
55681.25
Organism:
Homo sapiens (Human)
Description:
P31749
Residue:
480
  
Inhibitor
Name:
BDBM50312751
Synonyms:
(S)-N1-(5-(1H-indazol-5-yl)-1,3,4-thiadiazol-2-yl)-3-(2,4-dichlorophenyl)propane-1,2-diamine | CHEMBL1076581
Type:
Small organic molecule
Emp. Form.:
C18H16Cl2N6S
Mol. Mass.:
419.331
SMILES:
N[C@H](CNc1nnc(s1)-c1ccc2[nH]ncc2c1)Cc1ccc(Cl)cc1Cl
: