Target
Beta-secretase 1
Ligand
BDBM16036
Substrate
Meas. Tech.
ChEMBL_615460 (CHEMBL1107778)
IC50
193±n/a nM
Citation
 Rajapakse, HANantermet, PGSelnick, HGBarrow, JCMcGaughey, GBMunshi, SLindsley, SRYoung, MBNgo, PLHolloway, MKLai, MTEspeseth, ASShi, XPColussi, DPietrak, BCrouthamel, MCTugusheva, KHuang, QXu, MSimon, AJKuo, LHazuda, DJGraham, SVacca, JP SAR of tertiary carbinamine derived BACE1 inhibitors: role of aspartate ligand amine pKa in enzyme inhibition. Bioorg Med Chem Lett 20:1885-9 (2010)  
Target
Name:
Beta-secretase 1
Synonyms:
ASP2 Aspartyl protease 2 BACE1 Beta-secretase (BACE) Beta-secretase 1 (BACE 1) Beta-secretase 1 (BACE1) Beta-site amyloid precursor protein cleaving enzyme 1 Memapsin-2 beta-Secretase (BACE-1) | beta-Secretase (BACE1)
Type:
Protein
Mol. Mass.:
55755.10
Organism:
Homo sapiens (Human)
Description:
P56817
Residue:
501
  
Inhibitor
Name:
BDBM16036
Synonyms:
2-Amino-2-benzyl-3-hydroxypropyl-3-({[(1R)-1-(4-fluorophenyl)ethyl]amino}-carbonyl)-5-[methyl(methylsulfonyl)amino]benzoate L-001151442 | tertiary carbinamine ester 3
Type:
Small organic molecule
Emp. Form.:
C28H32FN3O6S
Mol. Mass.:
557.634
SMILES:
C[C@@H](NC(=O)c1cc(cc(c1)C(=O)OCC(N)(CO)Cc1ccccc1)N(C)S(C)(=O)=O)c1ccc(F)cc1
: