Target
Potassium voltage-gated channel subfamily H member 2
Ligand
BDBM50314525
Substrate
Meas. Tech.
ChEMBL_624632 (CHEMBL1111592)
IC50
>10000±n/a nM
Citation
 Lesuisse, DTiraboschi, GKrick, AAbecassis, PYDutruc-Rosset, GBabin, DHalley, FChâtreau, FLachaud, SChevalier, AQuarteronet, DBurgevin, MCAmara, CBertrand, PRooney, T Design of potent and selective GSK3beta inhibitors with acceptable safety profile and pharmacokinetics. Bioorg Med Chem Lett 20:2344-9 (2010)  
Target
Name:
Potassium voltage-gated channel subfamily H member 2
Synonyms:
1,3-beta-glucan synthase component GLS2 ERG Eag-related protein 1 Ether-a-go-go-related gene (HERG) Ether-a-go-go-related gene potassium channel 1 Ether-a-go-go-related gene potassium channel 1 (hERG1) Ether-a-go-go-related protein 1 H-ERG KCNH2 Potassium voltage-gated channel subfamily H member 2 (hERG) Voltage-gated potassium channel subunit Kv11.1 hERG Potassium Channel 1 | putative potassium channel subunit
Type:
Multi-pass membrane protein
Mol. Mass.:
126672.65
Organism:
Homo sapiens (Human)
Description:
Q12809
Residue:
1159
  
Inhibitor
Name:
BDBM50314525
Synonyms:
1-(6-chloro-5-phenyl-1H-indazol-3-yl)-3-phenylurea | CHEMBL1092134
Type:
Small organic molecule
Emp. Form.:
C20H15ClN4O
Mol. Mass.:
362.812
SMILES:
Clc1cc2[nH]nc(NC(=O)Nc3ccccc3)c2cc1-c1ccccc1
: