Target
Thymidine kinase 2, mitochondrial
Ligand
BDBM50314840
Substrate
Meas. Tech.
ChEMBL_627482 (CHEMBL1111768)
IC50
42±n/a nM
Citation
 Van Poecke, SNegri, AGago, FVan Daele, ISolaroli, NKarlsson, ABalzarini, JVan Calenbergh, S 3'-[4-Aryl-(1,2,3-triazol-1-yl)]-3'-deoxythymidine analogues as potent and selective inhibitors of human mitochondrial thymidine kinase. J Med Chem 53:2902-12 (2010)  
Target
Name:
Thymidine kinase 2, mitochondrial
Synonyms:
KITM_HUMAN Thymidine kinase, mitochondrial
Type:
PROTEIN
Mol. Mass.:
31013.50
Organism:
Homo sapiens (Human)
Description:
ChEMBL_1333885
Residue:
265
  
Inhibitor
Name:
BDBM50314840
Synonyms:
3'-Deoxy-3'-(4-(3,4-dichlorophenyl)-1,2,3-triazol-1-yl)-beta-D-thymidine | CHEMBL1090868
Type:
Small organic molecule
Emp. Form.:
C18H17Cl2N5O4
Mol. Mass.:
438.265
SMILES:
Cc1cn([C@H]2C[C@@H]([C@@H](CO)O2)n2cc(nn2)-c2ccc(Cl)c(Cl)c2)c(=O)[nH]c1=O
: