Target
Poly [ADP-ribose] polymerase 2
Ligand
BDBM50315779
Substrate
Meas. Tech.
ChEMBL_626085 (CHEMBL1110690)
Ki
1.5±n/a nM
Citation
 Penning, TDZhu, GDGong, JThomas, SGandhi, VBLiu, XShi, YKlinghofer, VJohnson, EFPark, CHFry, EHDonawho, CKFrost, DJBuchanan, FGBukofzer, GTRodriguez, LEBontcheva-Diaz, VBouska, JJOsterling, DJOlson, AMMarsh, KCLuo, YGiranda, VL Optimization of phenyl-substituted benzimidazole carboxamide poly(ADP-ribose) polymerase inhibitors: identification of (S)-2-(2-fluoro-4-(pyrrolidin-2-yl)phenyl)-1H-benzimidazole-4-carboxamide (A-966492), a highly potent and efficacious inhibitor. J Med Chem 53:3142-53 (2010)  
Target
Name:
Poly [ADP-ribose] polymerase 2
Synonyms:
(ARTD2 or PARP2) ADPRTL2 PARP2_HUMAN Poly [ADP-ribose] polymerase 2 (PARP2)
Type:
Enzyme
Mol. Mass.:
66225.70
Organism:
Homo sapiens (Human)
Description:
Q9UGN5
Residue:
583
  
Inhibitor
Name:
BDBM50315779
Synonyms:
(S)-2-(2-Fluoro-4-(pyrrolidin-2-yl)phenyl)-1H-benzimidazole-4-carboxamide | CHEMBL1090467
Type:
Small organic molecule
Emp. Form.:
C18H17FN4O
Mol. Mass.:
324.3522
SMILES:
NC(=O)c1cccc2[nH]c(nc12)-c1ccc(cc1F)[C@@H]1CCCN1
: