Target
Sodium-dependent serotonin transporter
Ligand
BDBM50302225
Substrate
Meas. Tech.
ChEMBL_630104 (CHEMBL1110024)
Ki
1±n/a nM
Citation
 Yan, YZhou, PRotella, DPFeenstra, RKruse, CGReinders, JHvan der Neut, MLai, MZhang, JKowal, DMCarrick, TMarquis, KLPausch, MHRobichaud, AJ Potent dihydroquinolinone dopamine D2 partial agonist/serotonin reuptake inhibitors for the treatment of schizophrenia. Bioorg Med Chem Lett 20:2983-6 (2010)  
Target
Name:
Sodium-dependent serotonin transporter
Synonyms:
5-HT Transporter 5HTT SC6A4_HUMAN SLC6A4 Serotonin transporter (5HTT) Sodium-dependent serotonin transporter (SERT) | Solute carrier family 6 member 4
Type:
Multi-pass membrane protein
Mol. Mass.:
70322.51
Organism:
Homo sapiens (Human)
Description:
P31645
Residue:
630
  
Inhibitor
Name:
BDBM50302225
Synonyms:
(1S)-1-[3-(dimethylamino)propyl]-1-(4-fluorophenyl)-1,3-dihydro-2-benzofuran-5-carbonitrile CHEMBL1508 ESCITALOPRAM OXALATE escitalopram
Type:
Small organic molecule
Emp. Form.:
C20H21FN2O
Mol. Mass.:
324.3919
SMILES:
CN(C)CCC[C@]1(OCc2cc(ccc12)C#N)c1ccc(F)cc1
: