Target
Glutamate receptor ionotropic, NMDA 1/2A
Ligand
BDBM50044140
Substrate
Meas. Tech.
ChEMBL_631316 (CHEMBL1105653)
IC50
6100±n/a nM
Citation
 Rook, YSchmidtke, KUGaube, FSchepmann, DWünsch, BHeilmann, JLehmann, JWinckler, T Bivalent beta-carbolines as potential multitarget anti-Alzheimer agents. J Med Chem 53:3611-7 (2010)  
Target
Name:
Glutamate receptor ionotropic, NMDA 1/2A
Synonyms:
Glutamate NMDA receptor; GRIN1/GRIN2A NR1/NR2A
Type:
Protein
Mol. Mass.:
Description:
Components:
This complex has 2 components.
Component 1
Name:
Glutamate receptor ionotropic, NMDA 1
Synonyms:
GRIN1 Glutamate [NMDA] receptor subunit zeta-1 N-methyl-D-aspartate receptor subunit NR1 NMDZ1_HUMAN | phencyclidine
Type:
Enzyme Catalytic Domain
Mol. Mass.:
105397.81
Organism:
Homo sapiens (Human)
Description:
Q05586
Residue:
938
  
Component 2
Name:
Glutamate receptor ionotropic, NMDA 2A
Synonyms:
GRIN2A Glutamate [NMDA] receptor Glutamate [NMDA] receptor subunit epsilon-1 NMDA receptor subtype 2A protein (NR2A) NMDE1_HUMAN hNR2A
Type:
Mol. Mass.:
165293.76
Organism:
Homo sapiens (Human)
Description:
Residue:
1464
  
Inhibitor
Name:
BDBM50044140
Synonyms:
2-(2-Chloro-phenyl)-2-methylamino-cyclohexanone CHEMBL742 Ketalar
Type:
Small organic molecule
Emp. Form.:
C13H16ClNO
Mol. Mass.:
237.725
SMILES:
CNC1(CCCCC1=O)c1ccccc1Cl
: