Target
Cell division control protein 42 homolog
Ligand
BDBM50319637
Substrate
Meas. Tech.
ChEMBL_634591 (CHEMBL1117932)
IC50
>8000±n/a nM
Citation
 Wu, FBüttner, FHChen, RHickey, EJakes, SKaplita, PKashem, MAKerr, SKugler, SPaw, ZProkopowicz, AShih, CKSnow, RYoung, ECywin, CL Substituted 2H-isoquinolin-1-one as potent Rho-Kinase inhibitors. Part 1: Hit-to-lead account. Bioorg Med Chem Lett 20:3235-9 (2010)  
Target
Name:
Cell division control protein 42 homolog
Synonyms:
CDC42 Cell division control protein 42 homolog cell division cycle 42 (GTP binding protein, 25kDa)
Type:
PROTEIN
Mol. Mass.:
21258.36
Organism:
Homo sapiens (Human)
Description:
ChEMBL_652970
Residue:
191
  
Inhibitor
Name:
BDBM50319637
Synonyms:
2-(benzylamino)-N-(7-chloro-1-oxo-1,2-dihydroisoquinolin-6-yl)acetamide | CHEMBL1084900
Type:
Small organic molecule
Emp. Form.:
C18H16ClN3O2
Mol. Mass.:
341.792
SMILES:
Clc1cc2c(cc[nH]c2=O)cc1NC(=O)CNCc1ccccc1
: