Target
Smoothened homolog
Ligand
BDBM50320352
Substrate
Meas. Tech.
ChEMBL_633891 (CHEMBL1120457)
IC50
20±n/a nM
Citation
 Lucas, BSAaron, WAn, SAustin, RJBrown, MChan, HChong, AHungate, RHuang, TJiang, BJohnson, MGKaizerman, JALee, GMcMinn, DLOrf, JPowers, JPRong, MToteva, MMUyeda, CWickramasinghe, DXu, GYe, QZhong, W Design of 1-piperazinyl-4-arylphthalazines as potent Smoothened antagonists. Bioorg Med Chem Lett 20:3618-22 (2010)  
Target
Name:
Smoothened homolog
Synonyms:
G-protein- coupled-like receptor Smoothened (Smo) SMOH Smoothened homolog
Type:
Protein
Mol. Mass.:
86415.51
Organism:
Homo sapiens (Human)
Description:
Q99835
Residue:
787
  
Inhibitor
Name:
BDBM50320352
Synonyms:
(4-(4-(3-methoxyphenyl)phthalazin-1-yl)piperazin-1-yl)(phenyl)methanone | CHEMBL1083740
Type:
Small organic molecule
Emp. Form.:
C26H24N4O2
Mol. Mass.:
424.4944
SMILES:
COc1cccc(c1)-c1nnc(N2CCN(CC2)C(=O)c2ccccc2)c2ccccc12
: