Target
Adenosine receptor A3
Ligand
BDBM50233086
Substrate
Meas. Tech.
ChEMBL_644538 (CHEMBL1211415)
Ki
>9000±n/a nM
Citation
 Cheng, FXu, ZLiu, GTang, Y Insights into binding modes of adenosine A(2B) antagonists with ligand-based and receptor-based methods. Eur J Med Chem 45:3459-71 (2010)  
Target
Name:
Adenosine receptor A3
Synonyms:
A3 adenosine receptor (hA3) ADORA3 | Adenosine A3 receptor (A3AR)
Type:
G Protein-Coupled Receptor (GPCR)
Mol. Mass.:
36197.32
Organism:
Homo sapiens (Human)
Description:
P0DMS8
Residue:
318
  
Inhibitor
Name:
BDBM50233086
Synonyms:
8-(1-((5-(4-chlorophenyl)-1,2,4-oxadiazol-3-yl)methyl)-1H-pyrazol-4-yl)-1-propyl-1H-purine-2,6(3H,7H)-dione CVT-6694
Type:
Small organic molecule
Emp. Form.:
C20H17ClN8O3
Mol. Mass.:
452.854
SMILES:
CCCn1c(=O)[nH]c2nc([nH]c2c1=O)-c1cnn(Cc2noc(n2)-c2ccc(Cl)cc2)c1
: