Target
Integrin alpha-4
Ligand
BDBM50325680
Substrate
Meas. Tech.
ChEMBL_652812 (CHEMBL1226015)
IC50
8300±n/a nM
Citation
 Rehman, ASoni, ANaik, KNair, SPalle, VPDastidar, SRay, AAlam, MSSalman, MCliffe, IASattigeri, V Synthesis and biological activity of N-substituted aminocarbonyl-1,3-dioxolanes as VLA-4 antagonists. Bioorg Med Chem Lett 20:5514-20 (2010)  
Target
Name:
Integrin alpha-4
Synonyms:
CD49 antigen-like family member D CD49d antigen ITA4_HUMAN Integrin alpha-4 Integrin alpha-IV VLA-4 integrin alpha 4 precursor | integrin alpha-4 precursor
Type:
Membrane Protein
Mol. Mass.:
114897.35
Organism:
Homo sapiens (Human)
Description:
P13612
Residue:
1032
  
Inhibitor
Name:
BDBM50325680
Synonyms:
(S)-2-((4R,5R)-5-(biphenyl-2-ylcarbamoyl)-1,3-dioxolane-4-carboxamido)-3-(4-(picolinamido)phenyl)propanoic acid | CHEMBL1223918
Type:
Small organic molecule
Emp. Form.:
C32H28N4O7
Mol. Mass.:
580.5873
SMILES:
OC(=O)[C@H](Cc1ccc(NC(=O)c2ccccn2)cc1)NC(=O)[C@@H]1OCO[C@H]1C(=O)Nc1ccccc1-c1ccccc1
: