Target
Melanin-concentrating hormone receptor 1
Ligand
BDBM50326860
Substrate
Meas. Tech.
ChEMBL_662927 (CHEMBL1252088)
Ki
2600±n/a nM
Citation
 Abbenante, GBecker, BBlanc, SClark, CCondie, GFraser, GGrathwohl, MHalliday, JHenderson, SLam, ALiu, LMann, MMuldoon, CPearson, APremraj, RRamsdale, TRossetti, TSchafer, KLe Thanh, GTometzki, GVari, FVerquin, GWaanders, JWest, MWimmer, NYau, AZuegg, JMeutermans, W Biological diversity from a structurally diverse library: systematically scanning conformational space using a pyranose scaffold. J Med Chem 53:5576-86 (2010)  
Target
Name:
Melanin-concentrating hormone receptor 1
Synonyms:
G-protein coupled receptor 24 MCH receptor 1 MCH-R1 MCHR-1 MCHR1_HUMAN Melanin-Concentrating Hormone Receptor 1 (MCH1R) Melanin-concentrating hormone receptor 1 (MCH-1) Melanin-concentrating hormone receptor 1 (MCHR-1) SLC-1 Somatostatin receptor-like protein
Type:
G Protein-Coupled Receptor (GPCR)
Mol. Mass.:
45976.27
Organism:
Homo sapiens (Human)
Description:
Membranes from CHO-K1 cells stably expressing human MCH1R were used in assays.
Residue:
422
  
Inhibitor
Name:
BDBM50326860
Synonyms:
CHEMBL1254711 | N-((3R,4R,5S,6R)-2-(4-chlorobenzyloxy)-5-hydroxy-6-(methoxymethyl)-4-(naphthalen-2-ylmethoxy)tetrahydro-2H-pyran-3-yl)-4-(diaminomethyleneamino)butanamide
Type:
Small organic molecule
Emp. Form.:
C30H37ClN4O6
Mol. Mass.:
585.091
SMILES:
[#6]-[#8]-[#6]-[#6@H]-1-[#8]-[#6](-[#8]-[#6]-c2ccc(Cl)cc2)-[#6@H](-[#7]-[#6](=O)-[#6]-[#6]-[#6]\[#7]=[#6](\[#7])-[#7])-[#6@@H](-[#8]-[#6]-c2ccc3ccccc3c2)-[#6@@H]-1-[#8]
: