Target
Mitogen-activated protein kinase 14
Ligand
BDBM50328772
Substrate
Meas. Tech.
ChEMBL_673596 (CHEMBL1274709)
IC50
66±n/a nM
Citation
 Ahn, YMClare, MEnsinger, CLHood, MMLord, JWLu, WPMiller, DFPatt, WCSmith, BDVogeti, LKaufman, MDPetillo, PAWise, SCAbendroth, JChun, LClark, RFeese, MKim, HStewart, LFlynn, DL Switch control pocket inhibitors of p38-MAP kinase. Durable type II inhibitors that do not require binding into the canonical ATP hinge region. Bioorg Med Chem Lett 20:5793-8 (2010)  
Target
Name:
Mitogen-activated protein kinase 14
Synonyms:
CSAID-binding protein CSBP1 CSPB1 MAP kinase 14 MAP kinase p38 alpha MAPK14 MK14_HUMAN Mitogen-activated protein kinase p38 alpha Stress-activated protein kinase 2a | p38 MAP kinase alpha/beta
Type:
Serine/threonine-protein kinase
Mol. Mass.:
41286.76
Organism:
Homo sapiens (Human)
Description:
Q16539
Residue:
360
  
Inhibitor
Name:
BDBM50328772
Synonyms:
2-(3-(5-(3-(2,3-dichlorophenyl)ureido)-3-(thiophen-2-yl)-1H-pyrazol-1-yl)phenyl)acetamide | CHEMBL1269839
Type:
Small organic molecule
Emp. Form.:
C22H17Cl2N5O2S
Mol. Mass.:
486.374
SMILES:
NC(=O)Cc1cccc(c1)-n1nc(cc1NC(=O)Nc1cccc(Cl)c1Cl)-c1cccs1
: