Target
TGF-beta receptor type-1
Ligand
BDBM50329802
Substrate
Meas. Tech.
ChEMBL_674822 (CHEMBL1272395)
IC50
32±n/a nM
Citation
 Roth, GJHeckel, ABrandl, TGrauert, MHoerer, SKley, JTSchnapp, GBaum, PMennerich, DSchnapp, APark, JE Design, synthesis, and evaluation of indolinones as inhibitors of the transforming growth factorß receptor I (TGFßRI). J Med Chem 53:7287-95 (2010)  
Target
Name:
TGF-beta receptor type-1
Synonyms:
ALK-5 Activin A receptor type II-like protein kinase of 53kD SKR4 TGF-beta receptor type I TGFBR1 TGFR1_HUMAN Transforming growth factor-beta receptor type I
Type:
enzyme
Mol. Mass.:
55968.24
Organism:
Homo sapiens (Human)
Description:
P36897
Residue:
503
  
Inhibitor
Name:
BDBM50329802
Synonyms:
(Z)-N-ethyl-3-((4-((ethylamino)methyl)phenylamino)(phenyl)methylene)-N-methyl-2-oxoindoline-6-carboxamide | CHEMBL1271471
Type:
Small organic molecule
Emp. Form.:
C28H30N4O2
Mol. Mass.:
454.5634
SMILES:
CCNCc1ccc(cc1)N=C(C1C(=O)Nc2cc(ccc12)C(=O)N(C)CC)c1ccccc1
: