Target
Platelet-derived growth factor receptor alpha
Ligand
BDBM50329795
Substrate
Meas. Tech.
ChEMBL_674819 (CHEMBL1274127)
IC50
59±n/a nM
Citation
 Roth, GJHeckel, ABrandl, TGrauert, MHoerer, SKley, JTSchnapp, GBaum, PMennerich, DSchnapp, APark, JE Design, synthesis, and evaluation of indolinones as inhibitors of the transforming growth factorß receptor I (TGFßRI). J Med Chem 53:7287-95 (2010)  
Target
Name:
Platelet-derived growth factor receptor alpha
Synonyms:
Alpha-type platelet-derived growth factor receptor PDGFRA PGFRA_HUMAN Platelet-derived growth factor receptor alpha (PDGFRA) RHEPDGFRA
Type:
Protein
Mol. Mass.:
122633.38
Organism:
Homo sapiens (Human)
Description:
P16234
Residue:
1089
  
Inhibitor
Name:
BDBM50329795
Synonyms:
(Z)-3-((4-(N-(3-(dimethylamino)propyl)acetamido)phenylamino)(phenyl)methylene)-N-ethyl-2-oxoindoline-6-carboxamide | CHEMBL1271736
Type:
Small organic molecule
Emp. Form.:
C31H35N5O3
Mol. Mass.:
525.6413
SMILES:
CCNC(=O)c1ccc2C(C(=Nc3ccc(cc3)N(CCCN(C)C)C(C)=O)c3ccccc3)C(=O)Nc2c1
: