Target
Stearoyl-CoA desaturase
Ligand
BDBM50330378
Substrate
Meas. Tech.
ChEMBL_683826 (CHEMBL1285217)
IC50
0.06±n/a nM
Citation
 Uto, YUeno, YKiyotsuka, YMiyazawa, YKurata, HOgata, TYamada, MDeguchi, TKonishi, MTakagi, TWakimoto, SOhsumi, J Synthesis and evaluation of novel stearoyl-CoA desaturase 1 inhibitors: 1'-{6-[5-(pyridin-3-ylmethyl)-1,3,4-oxadiazol-2-yl]pyridazin-3-yl}-3,4-dihydrospiro[chromene-2,4'-piperidine] analogs. Eur J Med Chem 45:4788-96 (2010)  
Target
Name:
Stearoyl-CoA desaturase
Synonyms:
Acyl-CoA desaturase SCD SCDOS Stearoyl-CoA (SCD1) | Stearoyl-CoA desaturase 1
Type:
Enzyme
Mol. Mass.:
41537.27
Organism:
Homo sapiens (Human)
Description:
O00767
Residue:
359
  
Inhibitor
Name:
BDBM50330378
Synonyms:
5-Chloro-1'-{6-[5-(pyridin-3-ylmethyl)-1,3,4-oxadiazol-2-yl]pyridazin-3-yl}-3,4-dihydrospiro[chromene-2,4'-piperidine] | CHEMBL1276595
Type:
Small organic molecule
Emp. Form.:
C25H23ClN6O2
Mol. Mass.:
474.942
SMILES:
Clc1cccc2OC3(CCN(CC3)c3ccc(nn3)-c3nnc(Cc4cccnc4)o3)CCc12
: