Target
17-beta-hydroxysteroid dehydrogenase type 2
Ligand
BDBM50330992
Substrate
Meas. Tech.
ChEMBL_684637 (CHEMBL1285470)
IC50
18±n/a nM
Citation
 Oster, AHinsberger, SWerth, RMarchais-Oberwinkler, SFrotscher, MHartmann, RW Bicyclic substituted hydroxyphenylmethanones as novel inhibitors of 17ß-hydroxysteroid dehydrogenase type 1 (17ß-HSD1) for the treatment of estrogen-dependent diseases. J Med Chem 53:8176-86 (2010)  
Target
Name:
17-beta-hydroxysteroid dehydrogenase type 2
Synonyms:
17-beta-Hydroxysteroid Dehydrogenase 2 (17-beta-HSD2) 20-alpha-HSD EDH17B2 Estradiol 17-beta-dehydrogenase 2 (17beta-HSD2) Microsomal 17-beta-hydroxysteroid dehydrogenas Testosterone 17-beta-dehydrogenase
Type:
Oxidoreductase; single-pass type II membrane protein
Mol. Mass.:
42795.29
Organism:
Homo sapiens (Human)
Description:
Enzyme was partially purified from human placenta.
Residue:
387
  
Inhibitor
Name:
BDBM50330992
Synonyms:
(3-hydroxyphenyl)(5-(2-hydroxyphenyl)thiophen-2-yl)methanone | CHEMBL1277341
Type:
Small organic molecule
Emp. Form.:
C17H12O3S
Mol. Mass.:
296.34
SMILES:
Oc1cccc(c1)C(=O)c1ccc(s1)-c1ccccc1O
: