Target
NPC1-like intracellular cholesterol transporter 1
Ligand
BDBM50332414
Substrate
Meas. Tech.
ChEMBL_696710 (CHEMBL1638622)
IC50
4200±n/a nM
Citation
 Howell, KLDeVita, RJGarcia-Calvo, MMeurer, RDLisnock, JBull, HGMcMasters, DRMcCann, MEMills, SG Spiroimidazolidinone NPC1L1 inhibitors. Part 2: structure-activity studies and in vivo efficacy. Bioorg Med Chem Lett 20:6929-32 (2010)  
Target
Name:
NPC1-like intracellular cholesterol transporter 1
Synonyms:
NPC1L1 Niemann-Pick C1-like protein 1
Type:
PROTEIN
Mol. Mass.:
148724.10
Organism:
Homo sapiens (Human)
Description:
ChEMBL_1451836
Residue:
1359
  
Inhibitor
Name:
BDBM50332414
Synonyms:
CHEMBL1631034 | N-(3-aminopropyl)-2-(8-(4-tert-butylbenzoyl)-4-oxo-1-phenyl-1,3,8-triazaspiro[4.5]decan-3-yl)acetamide
Type:
Small organic molecule
Emp. Form.:
C29H39N5O3
Mol. Mass.:
505.6517
SMILES:
CC(C)(C)c1ccc(cc1)C(=O)N1CCC2(CC1)N(CN(CC(=O)NCCCN)C2=O)c1ccccc1
: