Target
NPC1-like intracellular cholesterol transporter 1
Ligand
BDBM50332388
Substrate
Meas. Tech.
ChEMBL_696710 (CHEMBL1638622)
IC50
3100±n/a nM
Citation
 Howell, KLDeVita, RJGarcia-Calvo, MMeurer, RDLisnock, JBull, HGMcMasters, DRMcCann, MEMills, SG Spiroimidazolidinone NPC1L1 inhibitors. Part 2: structure-activity studies and in vivo efficacy. Bioorg Med Chem Lett 20:6929-32 (2010)  
Target
Name:
NPC1-like intracellular cholesterol transporter 1
Synonyms:
NPC1L1 Niemann-Pick C1-like protein 1
Type:
PROTEIN
Mol. Mass.:
148724.10
Organism:
Homo sapiens (Human)
Description:
ChEMBL_1451836
Residue:
1359
  
Inhibitor
Name:
BDBM50332388
Synonyms:
CHEMBL1632091 | ethyl 1-(2-(8-(4-tert-butylbenzoyl)-4-oxo-1-phenyl-1,3,8-triazaspiro[4.5]decan-3-yl)acetyl)piperidine-4-carboxylate
Type:
Small organic molecule
Emp. Form.:
C34H44N4O5
Mol. Mass.:
588.737
SMILES:
CCOC(=O)C1CCN(CC1)C(=O)CN1CN(c2ccccc2)C2(CCN(CC2)C(=O)c2ccc(cc2)C(C)(C)C)C1=O
: