Target
Metabotropic glutamate receptor 5
Ligand
BDBM50334109
Substrate
Meas. Tech.
ChEMBL_698079 (CHEMBL1645999)
IC50
8±n/a nM
Citation
 Gilbert, AMBursavich, MGLombardi, SAdedoyin, ADwyer, JMHughes, ZKern, JCKhawaja, XRosenzweig-Lipson, SMoore, WJNeal, SJOlsen, MRizzo, SJSpringer, D 3-(Pyridin-2-yl-ethynyl)benzamide metabotropic glutamate receptor 5 negative allosteric modulators: hit to lead studies. Bioorg Med Chem Lett 21:195-9 (2010)  
Target
Name:
Metabotropic glutamate receptor 5
Synonyms:
GRM5_RAT Grm5 Mglur5 metabotropic glutamate 5/1-C metabotropic glutamate 5a
Type:
Enzyme
Mol. Mass.:
131900.14
Organism:
Rattus norvegicus (Rat)
Description:
P31424
Residue:
1203
  
Inhibitor
Name:
BDBM50334109
Synonyms:
(4-methoxy-3-(pyridin-2-ylethynyl)phenyl)(4-(pyridin-2-yl)piperazin-1-yl)methanone | CHEMBL1645019
Type:
Small organic molecule
Emp. Form.:
C24H22N4O2
Mol. Mass.:
398.4571
SMILES:
COc1ccc(cc1C#Cc1ccccn1)C(=O)N1CCN(CC1)c1ccccn1
: