Target
Sucrase-isomaltase
Ligand
BDBM50312527
Substrate
Meas. Tech.
ChEMBL_701783 (CHEMBL1656920)
IC50
>1000000±n/a nM
Citation
 Ghisaidoobe, ABikker, Pde Bruijn, ACGodschalk, FDRogaar, EGuijt, MCHagens, PHalma, JMHart, SMLuitjens, SBvan Rixel, VHWijzenbroek, MZweegers, TDonker-Koopman, WEStrijland, ABoot, RMarel, GvOverkleeft, HSAerts, JM Identification of Potent and Selective Glucosylceramide Synthase Inhibitors from a Library of N-Alkylated Iminosugars ACS Med Chem Lett 2:119-123 (2011)  
Target
Name:
Sucrase-isomaltase
Synonyms:
Type:
PROTEIN
Mol. Mass.:
209081.85
Organism:
Mus musculus
Description:
ChEMBL_701783
Residue:
1818
  
Inhibitor
Name:
BDBM50312527
Synonyms:
CHEMBL1086996 | N-[5-(Adamantan-1-yl-methoxy)-pentyl]-L-ido-1-deoxynojirimycin
Type:
Small organic molecule
Emp. Form.:
C22H39NO5
Mol. Mass.:
397.5488
SMILES:
OC[C@H]1[C@@H](O)[C@H](O)[C@@H](O)CN1CCCCCOCC12CC3CC(CC(C3)C1)C2
: