Target
Tyrosine-protein phosphatase non-receptor type 22
Ligand
BDBM50335898
Substrate
Meas. Tech.
ChEMBL_715337 (CHEMBL1664624)
IC50
6200±n/a nM
Citation
 Vang, TXie, YLiu, WHVidovic, DLiu, YWu, SSmith, DHRinderspacher, AChung, CGong, GMustelin, TLandry, DWRickert, RCSchürer, SCDeng, SXTautz, L Inhibition of lymphoid tyrosine phosphatase by benzofuran salicylic acids. J Med Chem 54:562-71 (2011)  
Target
Name:
Tyrosine-protein phosphatase non-receptor type 22
Synonyms:
3.1.3.48 LyP Lymphoid phosphatase (Lyp) PEST-domain phosphatase PTPN22 Tyrosine-protein phosphatase non-receptor type 22 (LYP) | tyrosine-protein phosphatase non-receptor type 22 isoform 1
Type:
Mol. Mass.:
91712.31
Organism:
Homo sapiens (Human)
Description:
Q9Y2R2
Residue:
807
  
Inhibitor
Name:
BDBM50335898
Synonyms:
6-hydroxy-3-(1-(4-(naphthalen-1-ylamino)-4-oxobutyl)-1H-1,2,3-triazol-4-yl)-2-meta-tolylbenzofuran-5-carboxylic acid | CHEMBL1650920
Type:
Small organic molecule
Emp. Form.:
C32H26N4O5
Mol. Mass.:
546.5726
SMILES:
Cc1cccc(c1)-c1oc2cc(O)c(cc2c1-c1cn(CCCC(=O)Nc2cccc3ccccc23)nn1)C(O)=O
: