Target
Eukaryotic translation initiation factor 2-alpha kinase 3
Ligand
BDBM50336298
Substrate
Meas. Tech.
ChEMBL_716579 (CHEMBL1670303)
IC50
840±n/a nM
Citation
 Ren, LWenglowsky, SMiknis, GRast, BBuckmelter, AJEly, RJSchlachter, SLaird, ERRandolph, NCallejo, MMartinson, MGalbraith, SBrandhuber, BJVigers, GMorales, TVoegtli, WCLyssikatos, J Non-oxime inhibitors of B-Raf(V600E) kinase. Bioorg Med Chem Lett 21:1243-7 (2011)  
Target
Name:
Eukaryotic translation initiation factor 2-alpha kinase 3
Synonyms:
E2AK3_HUMAN HsPEK PERK Pancreatic endoplasmic reticulum kinase (PERK)
Type:
Enzyme
Mol. Mass.:
125190.66
Organism:
Homo sapiens (Human)
Description:
Q9NZJ5
Residue:
1116
  
Inhibitor
Name:
BDBM50336298
Synonyms:
CHEMBL1667920 | N-(7-methyl-1H-indazol-4-yl)-2-(pyrimidin-2-yl)furo[2,3-c]pyridin-3-amine
Type:
Small organic molecule
Emp. Form.:
C19H14N6O
Mol. Mass.:
342.3541
SMILES:
Cc1ccc(Nc2c(oc3cnccc23)-c2ncccn2)c2cn[nH]c12
: