Target
Eukaryotic translation initiation factor 2-alpha kinase 3
Ligand
BDBM50336310
Substrate
Meas. Tech.
ChEMBL_716579 (CHEMBL1670303)
IC50
9100±n/a nM
Citation
 Ren, LWenglowsky, SMiknis, GRast, BBuckmelter, AJEly, RJSchlachter, SLaird, ERRandolph, NCallejo, MMartinson, MGalbraith, SBrandhuber, BJVigers, GMorales, TVoegtli, WCLyssikatos, J Non-oxime inhibitors of B-Raf(V600E) kinase. Bioorg Med Chem Lett 21:1243-7 (2011)  
Target
Name:
Eukaryotic translation initiation factor 2-alpha kinase 3
Synonyms:
E2AK3_HUMAN HsPEK PERK Pancreatic endoplasmic reticulum kinase (PERK)
Type:
Enzyme
Mol. Mass.:
125190.66
Organism:
Homo sapiens (Human)
Description:
Q9NZJ5
Residue:
1116
  
Inhibitor
Name:
BDBM50336310
Synonyms:
CHEMBL1667905 | ethyl 3-(5-aminonaphthalen-2-ylamino)furo[2,3-c]pyridine-2-carboxylate
Type:
Small organic molecule
Emp. Form.:
C20H17N3O3
Mol. Mass.:
347.3673
SMILES:
CCOC(=O)c1oc2cnccc2c1Nc1ccc2c(N)cccc2c1
: