Target
Phosphatidylinositol 4-phosphate 3-kinase C2 domain-containing subunit alpha
Ligand
BDBM50338197
Substrate
Meas. Tech.
ChEMBL_727843 (CHEMBL1686448)
IC50
>10000±n/a nM
Citation
 Ohwada, JEbiike, HKawada, HTsukazaki, MNakamura, MMiyazaki, TMorikami, KYoshinari, KYoshida, MKondoh, OKuramoto, SOgawa, KAoki, YShimma, N Discovery and biological activity of a novel class I PI3K inhibitor, CH5132799. Bioorg Med Chem Lett 21:1767-72 (2011)  
Target
Name:
Phosphatidylinositol 4-phosphate 3-kinase C2 domain-containing subunit alpha
Synonyms:
P3C2A_HUMAN PIK3C2A Phosphatidylinositol-4-phosphate 3-kinase C2 domain-containing subunit alpha PtdIns-3-kinase C2 subunit alpha
Type:
Protein
Mol. Mass.:
190704.50
Organism:
Homo sapiens (Human)
Description:
O00443
Residue:
1686
  
Inhibitor
Name:
BDBM50338197
Synonyms:
5-(7-(methylsulfonyl)-2-morpholino-6,7-dihydro-5H-pyrrolo[2,3-d]pyrimidin-4-yl)pyrimidin-2-amine CHEMBL1684984
Type:
Small organic molecule
Emp. Form.:
C15H19N7O3S
Mol. Mass.:
377.421
SMILES:
CS(=O)(=O)N1CCc2c1nc(nc2-c1cnc(N)nc1)N1CCOCC1
: