Target
Cytochrome P450 2D6
Ligand
BDBM50340099
Substrate
Meas. Tech.
ChEMBL_741102 (CHEMBL1764373)
IC50
97800±n/a nM
Citation
 Ratcliffe, PAdam, JMBaker, JBursi, RCampbell, RClark, JKCottney, JEDeehan, MEasson, AMEcker, DEdwards, DEpemolu, OEvans, LFields, RFrancis, SHarradine, PJeremiah, FKiyoi, TMcArthur, DMorrison, APassier, PPick, JSchnabel, PGSchulz, JSteinbrede, HWalker, GWestwood, PWishart, Gde Haes, JU Design, synthesis and structure-activity relationships of (indo-3-yl) heterocyclic derivatives as agonists of the CB1 receptor. Discovery of a clinical candidate. Bioorg Med Chem Lett 21:2541-6 (2011)  
Target
Name:
Cytochrome P450 2D6
Synonyms:
CP2D6_HUMAN CYP2DL1 Cytochrome P450 2D6 (CYP2D6) P450-DB1
Type:
Protein
Mol. Mass.:
55774.82
Organism:
Homo sapiens (Human)
Description:
P10635
Residue:
497
  
Inhibitor
Name:
BDBM50340099
Synonyms:
2-(((2-(7-chloro-1-((tetrahydro-2H-pyran-4-yl)methyl)-1H-indol-3-yl)thiazol-4-yl)methyl)(isopropyl)amino)ethanol | CHEMBL1762808
Type:
Small organic molecule
Emp. Form.:
C23H30ClN3O2S
Mol. Mass.:
448.021
SMILES:
CC(C)N(CCO)Cc1csc(n1)-c1cn(CC2CCOCC2)c2c(Cl)cccc12
: