Target
Melatonin receptor type 1A
Ligand
BDBM50340332
Substrate
Meas. Tech.
ChEMBL_741504 (CHEMBL1763819)
Ki
>10000±n/a nM
Citation
 Jeanty, MSuzenet, FDelagrange, PNosjean, OBoutin, JACaignard, DHGuillaumet, G Design and synthesis of 1-(2-alkanamidoethyl)-6-methoxy-7-azaindole derivatives as potent melatonin agonists. Bioorg Med Chem Lett 21:2316-9 (2011)  
Target
Name:
Melatonin receptor type 1A
Synonyms:
MTNR1A MTR1A_HUMAN Mel1a melatonin receptor Melatonin receptor Melatonin receptor type 1 (MT1) | Melatonin receptor type 1A
Type:
Enzyme
Mol. Mass.:
39392.94
Organism:
Homo sapiens (Human)
Description:
P48039
Residue:
350
  
Inhibitor
Name:
BDBM50340332
Synonyms:
CHEMBL1760951 | N-(2-(6-methoxy-3-(morpholinomethyl)-1H-pyrrolo[2,3-b]pyridin-1-yl)ethyl)acetamide
Type:
Small organic molecule
Emp. Form.:
C17H24N4O3
Mol. Mass.:
332.3975
SMILES:
COc1ccc2c(CN3CCOCC3)cn(CCNC(C)=O)c2n1
: