Target
Tyrosine-protein kinase Lck
Ligand
BDBM50341376
Substrate
Meas. Tech.
ChEMBL_742455 (CHEMBL1769103)
Kd
0.2±n/a nM
Citation
 Goldstein, DMSoth, MGabriel, TDewdney, NKuglstatter, AArzeno, HChen, JBingenheimer, WDalrymple, SADunn, JFarrell, RFrauchiger, SLa Fargue, JGhate, MGraves, BHill, RJLi, FLitman, RLoe, BMcIntosh, JMcWeeney, DPapp, EPark, JReese, HFRoberts, RTRotstein, DSan Pablo, BSarma, KStahl, MSung, MLSuttman, RTSjogren, EBTan, YTrejo, AWelch, MWeller, PWong, BRZecic, H Discovery of 6-(2,4-difluorophenoxy)-2-[3-hydroxy-1-(2-hydroxyethyl)propylamino]-8-methyl-8H-pyrido[2,3-d]pyrimidin-7-one (pamapimod) and 6-(2,4-difluorophenoxy)-8-methyl-2-(tetrahydro-2H-pyran-4-ylamino)pyrido[2,3-d]pyrimidin-7(8H)-one (R1487) as orally bioavailable and highly selective inhibitors J Med Chem 54:2255-65 (2011)  
Target
Name:
Tyrosine-protein kinase Lck
Synonyms:
2.7.10.2 LCK_HUMAN Leukocyte C-terminal Src kinase Lymphocyte-specific protein tyrosine kinase Protein YT16 Proto-oncogene tyrosine-protein kinase LCK T cell-specific protein-tyrosine kinase
Type:
Mol. Mass.:
57987.83
Organism:
Homo sapiens (Human)
Description:
P06239
Residue:
509
  
Inhibitor
Name:
BDBM50341376
Synonyms:
3-(2,6-dichlorophenyl)-7-(4-(2-(diethylamino)ethoxy)phenylamino)-1-methyl-3,4-dihydropyrimido[4,5-d]pyrimidin-2(1H)-one CHEMBL1234002
Type:
Small organic molecule
Emp. Form.:
C25H28Cl2N6O2
Mol. Mass.:
515.435
SMILES:
CCN(CC)CCOc1ccc(Nc2ncc3CN(C(=O)N(C)c3n2)c2c(Cl)cccc2Cl)cc1
: