Target
M-phase inducer phosphatase 1
Ligand
BDBM50341999
Substrate
Meas. Tech.
ChEMBL_743506 (CHEMBL1767947)
IC50
800±n/a nM
Citation
 Vintonyak, VVWaldmann, HRauh, D Using small molecules to target protein phosphatases. Bioorg Med Chem 19:2145-55 (2011)  
Target
Name:
M-phase inducer phosphatase 1
Synonyms:
CDC25A Dual specificity phosphatase Cdc25A MPIP1_HUMAN | phosphatase Cdc25
Type:
Protein
Mol. Mass.:
59090.18
Organism:
Homo sapiens (Human)
Description:
P30304
Residue:
524
  
Inhibitor
Name:
BDBM50341999
Synonyms:
(R)-5-hydroxy-4-(2-((1R,2R,5S,8aS)-1,2,5-trimethyl-5-(4-methylpent-4-enyl)-1,2,3,5,6,7,8,8a-octahydronaphthalen-1-yl)acetyl)furan-2(5H)-one | CHEMBL1765355
Type:
Small organic molecule
Emp. Form.:
C25H36O4
Mol. Mass.:
400.5509
SMILES:
C[C@@H]1CC=C2[C@@H](CCC[C@@]2(C)CCCC(C)=C)[C@]1(C)CC(=O)C1=CC(=O)O[C@H]1O
: